Reaction Details
TargetC-C motif chemokine 2
LigandBDBM50440559
Substrate/Competitorn/a
Meas. Tech.ChEMBL_983389 (CHEMBL2428943)
Ki 35±n/a nM
Citation Vilums, MZweemer, AJYu, Zde Vries, HHillger, JMWapenaar, HBollen, IABarmare, FGross, RClemens, JKrenitsky, PBrussee, JStamos, DSaunders, JHeitman, LHIjzerman, AP Structure-kinetic relationships--an overlooked parameter in hit-to-lead optimization: a case of cyclopentylamines as chemokine receptor 2 antagonists. J Med Chem56:7706-14 (2013) 
 
C-C motif chemokine 2
Name:C-C motif chemokine 2
Type:PROTEIN
Mol. Mass.:11032.44
Organism:Homo sapiens (Human)
Description:ChEMBL_1363188
Residue:99
BDBM50440559
NameBDBM50440559
Synonyms:CHEMBL2426337
TypeSmall organic molecule
Emp. Form.C28H32F6N2O2
Mol. Mass.542.5563
SMILESCC(C)[C@@]1(CC[C@H](C1)NC1CCCc2c(O)cccc12)C(=O)NCc1cc(cc(c1)C(F)(F)F)C(F)(F)F