Reaction Details
TargetMBT domain-containing protein 1
LigandBDBM50440566
Substrate/Competitorn/a
Meas. Tech.ChEMBL_983404 (CHEMBL2429074)
IC50>10000±n/a nM
Citation James, LIKorboukh, VKKrichevsky, LBaughman, BMHerold, JMNorris, JLJin, JKireev, DBJanzen, WPArrowsmith, CHFrye, SV Small-molecule ligands of methyl-lysine binding proteins: optimization of selectivity for L3MBTL3. J Med Chem56:7358-71 (2013) 
 
MBT domain-containing protein 1
Name:MBT domain-containing protein 1
Type:Protein
Mol. Mass.:70557.67
Organism:Homo sapiens (Human)
Description:n/a
Residue:628
BDBM50440566
NameBDBM50440566
Synonyms:CHEMBL2426478
TypeSmall organic molecule
Emp. Form.C26H39N5O2
Mol. Mass.453.6202
SMILESNc1cc(ccc1C(=O)N1CCC(CC1)N1CCCC1)C(=O)N1CCC(CC1)N1CCCC1