Reaction Details
TargetLethal(3)malignant brain tumor-like protein 3
LigandBDBM50440603
Substrate/Competitorn/a
Meas. Tech.ChEMBL_983409 (CHEMBL2429079)
IC50 71±n/a nM
Citation James, LIKorboukh, VKKrichevsky, LBaughman, BMHerold, JMNorris, JLJin, JKireev, DBJanzen, WPArrowsmith, CHFrye, SV Small-molecule ligands of methyl-lysine binding proteins: optimization of selectivity for L3MBTL3. J Med Chem56:7358-71 (2013) 
 
Lethal(3)malignant brain tumor-like protein 3
Name:Lethal(3)malignant brain tumor-like protein 3
Type:Protein
Mol. Mass.:88334.17
Organism:Homo sapiens (Human)
Description:n/a
Residue:780
BDBM50440603
NameBDBM50440603
Synonyms:CHEMBL2426498
TypeSmall organic molecule
Emp. Form.C26H38N4O2
Mol. Mass.438.6055
SMILESO=C(N1CCC(CC1)N1CCCC1)c1ccc(cc1)C(=O)N1CCC(CC1)N1CCCC1