Reaction Details
TargetLethal(3)malignant brain tumor-like protein 3
LigandBDBM50440592
Substrate/Competitorn/a
Meas. Tech.ChEMBL_983410 (CHEMBL2429080)
IC50 81±n/a nM
Citation James, LIKorboukh, VKKrichevsky, LBaughman, BMHerold, JMNorris, JLJin, JKireev, DBJanzen, WPArrowsmith, CHFrye, SV Small-molecule ligands of methyl-lysine binding proteins: optimization of selectivity for L3MBTL3. J Med Chem56:7358-71 (2013) 
 
Lethal(3)malignant brain tumor-like protein 3
Name:Lethal(3)malignant brain tumor-like protein 3
Type:Protein
Mol. Mass.:88334.17
Organism:Homo sapiens (Human)
Description:n/a
Residue:780
BDBM50440592
NameBDBM50440592
Synonyms:CHEMBL2426489
TypeSmall organic molecule
Emp. Form.C27H41N4O2
Mol. Mass.453.6395
SMILESC[N+]1(CCCC1)C1CCN(CC1)C(=O)c1ccc(cc1)C(=O)N1CCC(CC1)N1CCCC1