Reaction Details
TargetPHD finger protein 23
LigandBDBM50440585
Substrate/Competitorn/a
Meas. Tech.ChEMBL_983401 (CHEMBL2429071)
IC50>10000±n/a nM
Citation James, LIKorboukh, VKKrichevsky, LBaughman, BMHerold, JMNorris, JLJin, JKireev, DBJanzen, WPArrowsmith, CHFrye, SV Small-molecule ligands of methyl-lysine binding proteins: optimization of selectivity for L3MBTL3. J Med Chem56:7358-71 (2013) 
 
PHD finger protein 23
Name:PHD finger protein 23
Type:Protein
Mol. Mass.:43813.67
Organism:Homo sapiens (Human)
Description:n/a
Residue:403
BDBM50440585
NameBDBM50440585
Synonyms:CHEMBL2426496
TypeSmall organic molecule
Emp. Form.C27H40N4O2
Mol. Mass.452.6321
SMILESO=C(N1CCC(CC1)N1CCCC1)c1ccc(cc1)C(=O)N1CCCC(CC1)N1CCCC1