Reaction Details
TargetLethal(3)malignant brain tumor-like protein 4
LigandBDBM50440583
Substrate/Competitorn/a
Meas. Tech.ChEMBL_983407 (CHEMBL2429077)
IC50>10000±n/a nM
Citation James, LIKorboukh, VKKrichevsky, LBaughman, BMHerold, JMNorris, JLJin, JKireev, DBJanzen, WPArrowsmith, CHFrye, SV Small-molecule ligands of methyl-lysine binding proteins: optimization of selectivity for L3MBTL3. J Med Chem56:7358-71 (2013) 
 
Lethal(3)malignant brain tumor-like protein 4
Name:Lethal(3)malignant brain tumor-like protein 4
Type:PROTEIN
Mol. Mass.:71132.81
Organism:Homo sapiens (Human)
Description:ChEMBL_983407
Residue:623
BDBM50440583
NameBDBM50440583
Synonyms:CHEMBL2426462
TypeSmall organic molecule
Emp. Form.C25H36N4O2
Mol. Mass.424.5789
SMILESO=C(N1CCC(C1)N1CCCC1)c1ccc(cc1)C(=O)N1CCC(CC1)N1CCCC1