Reaction Details
TargetTP53-binding protein 1
LigandBDBM50440613
Substrate/Competitorn/a
Meas. Tech.ChEMBL_983402 (CHEMBL2429072)
IC50 8700±n/a nM
Citation James, LIKorboukh, VKKrichevsky, LBaughman, BMHerold, JMNorris, JLJin, JKireev, DBJanzen, WPArrowsmith, CHFrye, SV Small-molecule ligands of methyl-lysine binding proteins: optimization of selectivity for L3MBTL3. J Med Chem56:7358-71 (2013) 
 
TP53-binding protein 1
Name:TP53-binding protein 1
Type:PROTEIN
Mol. Mass.:213442.98
Organism:Homo sapiens (Human)
Description:ChEMBL_107658
Residue:1972
BDBM50440613
NameBDBM50440613
Synonyms:CHEMBL2426365
TypeSmall organic molecule
Emp. Form.C33H45N5O2
Mol. Mass.543.7427
SMILESO=C(N1CCC(CC1)N1CCCC1)c1ccc(C(=O)N2CCC(CC2)N2CCCC2)c(NCc2ccccc2)c1