Reaction Details
TargetCalcitonin gene-related peptide type 1 receptor
LigandBDBM50440785
Substrate/Competitorn/a
Meas. Tech.ChEMBL_986467 (CHEMBL2434392)
Ki 0.094000±n/a nM
Citation Bell, IMGallicchio, SNStump, CABruno, JGFan, HGantert, LTHostetler, EDKemmerer, ALMcWherter, MMoore, ELMosser, SDPurcell, MLRiffel, KSalvatore, CASanabria-Bohórquez, SStaas, DDWhite, RBWilliams, MZartman, CBCook, JJHargreaves, RJKane, SAGraham, SLSelnick, HG [(11)C]MK-4232: The First Positron Emission Tomography Tracer for the Calcitonin Gene-Related Peptide Receptor. ACS Med Chem Lett4:863-8 (2013) 
 
Calcitonin gene-related peptide type 1 receptor
Name:Calcitonin gene-related peptide type 1 receptor
Type:Enzyme Catalytic Domain
Mol. Mass.:52980.45
Organism:Homo sapiens (Human)
Description:Q16602
Residue:461
BDBM50440785
NameBDBM50440785
Synonyms:CHEMBL2431252
TypeSmall organic molecule
Emp. Form.C34H34F2N4O2
Mol. Mass.568.6562
SMILESCN1C[C@](C)(N(C\C=C\c2ccc3C[C@]4(Cc3c2)C(=O)Nc2ncccc42)C(=O)C11CCCC1)c1cc(F)cc(F)c1