Reaction Details
TargetProteinase-activated receptor 2
LigandBDBM50440870
Substrate/Competitorn/a
Meas. Tech.ChEMBL_984148 (CHEMBL2432076)
IC50 50000±n/a nM
Citation Yau, MKLiu, LFairlie, DP Toward drugs for protease-activated receptor 2 (PAR2). J Med Chem56:7477-97 (2013) 
 
Proteinase-activated receptor 2
Name:Proteinase-activated receptor 2
Type:Enzyme Catalytic Domain
Mol. Mass.:44466.34
Organism:RAT
Description:PAR2 F2RL1 RAT::Q63645
Residue:397
BDBM50440870
NameBDBM50440870
Synonyms:CHEMBL2431726
TypeSmall organic molecule
Emp. Form.C29H56N10O7
Mol. Mass.656.8177
SMILES[#6]-[#6]-[#6@H](-[#6])-[#6@H](-[#7]-[#6](=O)-[#6@H](-[#6]-[#8])-[#7]-[#6](=O)-[#6@@H](-[#7])-[#6]-[#6](-[#6])-[#6])-[#6](=O)-[#7]-[#6]-[#6](=O)-[#7]-[#6@@H](-[#6]-[#6]-[#6]\[#7]=[#6](/[#7])-[#7])-[#6](=O)-[#7]-[#6@@H](-[#6]-[#6](-[#6])-[#6])-[#6](-[#7])=O