Reaction Details
TargetHepatocyte growth factor receptor
LigandBDBM50440902
Substrate/Competitorn/a
Meas. Tech.ChEMBL_984696 (CHEMBL2434668)
Ki 12±n/a nM
Citation Cui, JJShen, HTran-Dubé, MNambu, MMcTigue, MGrodsky, NRyan, KYamazaki, SAguirre, SParker, MLi, QZou, HChristensen, J Lessons from (S)-6-(1-(6-(1-methyl-1H-pyrazol-4-yl)-[1,2,4]triazolo[4,3-b]pyridazin-3-yl)ethyl)quinoline (PF-04254644), an inhibitor of receptor tyrosine kinase c-Met with high protein kinase selectivity but broad phosphodiesterase family inhibition leading to myocardial degeneration in rats. J Med Chem56:6651-65 (2013) 
 
Hepatocyte growth factor receptor
Name:Hepatocyte growth factor receptor
Type:Protein
Mol. Mass.:155559.73
Organism:Homo sapiens (Human)
Description:P08581
Residue:1390
BDBM50440902
NameBDBM50440902
Synonyms:CHEMBL2431832
TypeSmall organic molecule
Emp. Form.C23H19N5O2S
Mol. Mass.429.494
SMILESC[C@H](c1nnc2ccc(nn12)-c1ccc(cc1)S(C)(=O)=O)c1ccc2ncccc2c1