Reaction Details
TargetHistamine H2 receptor
LigandBDBM50440997
Substrate/Competitorn/a
Meas. Tech.ChEMBL_985420 (CHEMBL2432449)
Ki>10000±n/a nM
Citation Banister, SDManoli, MBarron, MLWerry, ELKassiou, M N-substituted 8-aminopentacyclo[5.4.0.0(2,6).0(3,10).0(5,9)]undecanes ass receptor ligands with potential neuroprotective effects. Bioorg Med Chem21:6038-52 (2013) 
 
Histamine H2 receptor
Name:Histamine H2 receptor
Type:G Protein-Coupled Receptor (GPCR)
Mol. Mass.:40115.31
Organism:Homo sapiens (Human)
Description:n/a
Residue:359
BDBM50440997
NameBDBM50440997
Synonyms:CHEMBL2432055
TypeSmall organic molecule
Emp. Form.C19H23N
Mol. Mass.265.3926
SMILESCN(Cc1ccccc1)[C@@H]1C2C3CC4C5CC(C2C35)C14