Reaction Details
TargetHistamine H1 receptor
LigandBDBM50440989
Substrate/Competitorn/a
Meas. Tech.ChEMBL_985421 (CHEMBL2432450)
Ki 4178±n/a nM
Citation Banister, SDManoli, MBarron, MLWerry, ELKassiou, M N-substituted 8-aminopentacyclo[5.4.0.0(2,6).0(3,10).0(5,9)]undecanes ass receptor ligands with potential neuroprotective effects. Bioorg Med Chem21:6038-52 (2013) 
 
Histamine H1 receptor
Name:Histamine H1 receptor
Type:G Protein-Coupled Receptor (GPCR)
Mol. Mass.:55808.72
Organism:Homo sapiens (Human)
Description:Cell pellets from SK-N-MC cells transfected with human H1 receptor were used in binding assay.
Residue:487
BDBM50440989
NameBDBM50440989
Synonyms:CHEMBL2429890
TypeSmall organic molecule
Emp. Form.C19H21NO2
Mol. Mass.295.3755
SMILESC(N[C@@H]1C2C3CC4C5CC(C2C35)C14)c1ccc2OCOc2c1