Reaction Details
TargetD(2) dopamine receptor
LigandBDBM50440991
Substrate/Competitorn/a
Meas. Tech.ChEMBL_985425 (CHEMBL2432454)
Ki>10000±n/a nM
Citation Banister, SDManoli, MBarron, MLWerry, ELKassiou, M N-substituted 8-aminopentacyclo[5.4.0.0(2,6).0(3,10).0(5,9)]undecanes ass receptor ligands with potential neuroprotective effects. Bioorg Med Chem21:6038-52 (2013) 
 
D(2) dopamine receptor
Name:D(2) dopamine receptor
Type:Cell-surface receptors
Mol. Mass.:50647.10
Organism:Homo sapiens (Human)
Description:P14416
Residue:443
BDBM50440991
NameBDBM50440991
Synonyms:CHEMBL2432048
TypeSmall organic molecule
Emp. Form.C19H23N
Mol. Mass.265.3926
SMILESC(Cc1ccccc1)N[C@@H]1C2C3CC4C5CC(C2C35)C14