Reaction Details
TargetHistamine H2 receptor
LigandBDBM50334455
Substrate/Competitorn/a
Meas. Tech.ChEMBL_985420 (CHEMBL2432449)
Ki 4423±n/a nM
Citation Banister, SDManoli, MBarron, MLWerry, ELKassiou, M N-substituted 8-aminopentacyclo[5.4.0.0(2,6).0(3,10).0(5,9)]undecanes ass receptor ligands with potential neuroprotective effects. Bioorg Med Chem21:6038-52 (2013) 
 
Histamine H2 receptor
Name:Histamine H2 receptor
Type:G Protein-Coupled Receptor (GPCR)
Mol. Mass.:40115.31
Organism:Homo sapiens (Human)
Description:n/a
Residue:359
BDBM50334455
NameBDBM50334455
Synonyms:CHEMBL1643900 | N-(2-(3'-Fluorophenyl)ethyl)-8-aminopentacyclo[5.4.0.02,6.03,10.05,9]undecane
TypeSmall organic molecule
Emp. Form.C19H22FN
Mol. Mass.283.3831
SMILESFc1cccc(CCN[C@@H]2C3C4CC5C6CC(C3C46)C25)c1