Reaction Details
TargetCalcitonin gene-related peptide type 1 receptor
LigandBDBM50268484
Substrate/Competitorn/a
Meas. Tech.ChEMBL_985765 (CHEMBL2433982)
IC50 0.026000±n/a nM
Citation Tora, GDegnan, APConway, CMKostich, WADavis, CDPin, SSSchartman, RXu, CWidmann, KAMacor, JEDubowchik, GM Preparation of imidazoles as potent calcitonin gene-related peptide (CGRP) antagonists. Bioorg Med Chem Lett23:5684-8 (2013) 
 
Calcitonin gene-related peptide type 1 receptor
Name:Calcitonin gene-related peptide type 1 receptor
Type:Enzyme Catalytic Domain
Mol. Mass.:52980.45
Organism:Homo sapiens (Human)
Description:Q16602
Residue:461
BDBM50268484
NameBDBM50268484
Synonyms:(R)-4-(8-Fluoro-2-oxo-1,2-dihydroquinazolin-3(4H)-yl)-N-(3-(7-methyl-1H-indazol-5-yl)-1-oxo-1-(4-(piperidin-1-yl)piperidin-1-yl)propan-2-yl)piperidine-1-carboxamide BMS-694153 | CHEMBL450668
TypeSmall organic molecule
Emp. Form.C35H45FN8O3
Mol. Mass.644.782
SMILESCc1cc(C[C@@H](NC(=O)N2CCC(CC2)N2Cc3cccc(F)c3NC2=O)C(=O)N2CCC(CC2)N2CCCCC2)cc2cn[nH]c12