Reaction Details
TargetCasein kinase I isoform delta
LigandBDBM50229971
Substrate/Competitorn/a
Meas. Tech.ChEMBL_986151 (CHEMBL2432951)
IC50 353±n/a nM
Citation Huart, ASSaxty, BMerritt, ANekulova, MLewis, SHuang, YVojtesek, BKettleborough, CHupp, TR A Casein kinase 1/Checkpoint kinase 1 pyrazolo-pyridine protein kinase inhibitor as novel activator of the p53 pathway. Bioorg Med Chem Lett23:5578-85 (2013) 
 
Casein kinase I isoform delta
Name:Casein kinase I isoform delta
Type:Enzyme
Mol. Mass.:47342.73
Organism:Rattus norvegicus (rat)
Description:Q06486
Residue:415
BDBM50229971
NameBDBM50229971
Synonyms:4-(4-(2,3-Dihydrobenzo[1,4]dioxin-6-yl)-5-pyridin-2-yl-1H-imidazol-2-yl)benzamide 4-[4-(2,3-dihydro-benzo[1,4]dioxin-6-yl)-5-pyridin-2-yl-1H-imidazol-2-yl]benzamide | CHEMBL410456
TypeSmall organic molecule
Emp. Form.C23H18N4O3
Mol. Mass.398.414
SMILESNC(=O)c1ccc(cc1)-c1nc(c([nH]1)-c1ccc2OCCOc2c1)-c1ccccn1