Reaction Details
TargetD(2) dopamine receptor
LigandBDBM50441093
Substrate/Competitorn/a
Meas. Tech.ChEMBL_986562 (CHEMBL2434803)
Ki 199±n/a nM
Citation Insua, IAlvarado, MMasaguer, CFIglesias, ABrea, JLoza, MICarro, L Synthesis and binding affinity of new 1,4-disubstituted triazoles as potential dopamine D(3) receptor ligands. Bioorg Med Chem Lett23:5586-91 (2013) 
 
D(2) dopamine receptor
Name:D(2) dopamine receptor
Type:Cell-surface receptors
Mol. Mass.:50647.10
Organism:Homo sapiens (Human)
Description:P14416
Residue:443
BDBM50441093
NameBDBM50441093
Synonyms:CHEMBL2430440
TypeSmall organic molecule
Emp. Form.C23H30N6O
Mol. Mass.406.5239
SMILESCOc1ccccc1N1CCN(CCCCn2cc(nn2)-c2ccc(N)cc2)CC1