Reaction Details
TargetD(2) dopamine receptor
LigandBDBM50441095
Substrate/Competitorn/a
Meas. Tech.ChEMBL_986562 (CHEMBL2434803)
Ki 227±n/a nM
Citation Insua, IAlvarado, MMasaguer, CFIglesias, ABrea, JLoza, MICarro, L Synthesis and binding affinity of new 1,4-disubstituted triazoles as potential dopamine D(3) receptor ligands. Bioorg Med Chem Lett23:5586-91 (2013) 
 
D(2) dopamine receptor
Name:D(2) dopamine receptor
Type:Cell-surface receptors
Mol. Mass.:50647.10
Organism:Homo sapiens (Human)
Description:P14416
Residue:443
BDBM50441095
NameBDBM50441095
Synonyms:CHEMBL2430442
TypeSmall organic molecule
Emp. Form.C23H28BrN5O
Mol. Mass.470.405
SMILESCOc1ccccc1N1CCN(CCCCn2cc(nn2)-c2ccc(Br)cc2)CC1