Reaction Details
TargetDelta-aminolevulinic acid dehydratase
LigandBDBM50441097
Substrate/Competitorn/a
Meas. Tech.ChEMBL_983894 (CHEMBL2433504)
IC50 85300±n/a nM
Citation Lentz, CSStumpfe, DBajorath, JFamulok, MHoerauf, APfarr, KM New chemotypes for wALADin1-like inhibitors of delta-aminolevulinic acid dehydratase from Wolbachia endobacteria. Bioorg Med Chem Lett23:5558-62 (2013) 
 
Delta-aminolevulinic acid dehydratase
Name:Delta-aminolevulinic acid dehydratase
Type:PROTEIN
Mol. Mass.:36296.00
Organism:Homo sapiens (Human)
Description:ChEMBL_1365623
Residue:330
BDBM50441097
NameBDBM50441097
Synonyms:CHEMBL2430564
TypeSmall organic molecule
Emp. Form.C11H7ClO2S
Mol. Mass.238.69
SMILESOC(=O)c1cc(cs1)-c1ccc(Cl)cc1