Reaction Details
TargetBromodomain-containing protein 4
LigandBDBM50365463
Substrate/Competitorn/a
Meas. Tech.ChEMBL_985086 (CHEMBL2433591)
IC50 631±n/a nM
Citation Mirguet, OGosmini, RToum, JClément, CABarnathan, MBrusq, JMMordaunt, JEGrimes, RMCrowe, MPineau, OAjakane, MDaugan, AJeffrey, PCutler, LHaynes, ACSmithers, NNChung, CWBamborough, PUings, IJLewis, AWitherington, JParr, NPrinjha, RKNicodème, E Discovery of epigenetic regulator I-BET762: lead optimization to afford a clinical candidate inhibitor of the BET bromodomains. J Med Chem56:7501-15 (2013) 
 
Bromodomain-containing protein 4
Name:Bromodomain-containing protein 4
Type:Protein
Mol. Mass.:152264.84
Organism:Homo sapiens (Human)
Description:O60885
Residue:1362
BDBM50365463
NameBDBM50365463
Synonyms:CHEMBL1232461
TypeSmall organic molecule
Emp. Form.C22H22ClN5O2
Mol. Mass.423.895
SMILESCCNC(=O)C[C@@H]1N=C(c2ccc(Cl)cc2)c2cc(OC)ccc2-n2c(C)nnc12