Reaction Details
TargetBromodomain-containing protein 3
LigandBDBM50441168
Substrate/Competitorn/a
Meas. Tech.ChEMBL_985089 (CHEMBL2433594)
IC50 501±n/a nM
Citation Mirguet, OGosmini, RToum, JClément, CABarnathan, MBrusq, JMMordaunt, JEGrimes, RMCrowe, MPineau, OAjakane, MDaugan, AJeffrey, PCutler, LHaynes, ACSmithers, NNChung, CWBamborough, PUings, IJLewis, AWitherington, JParr, NPrinjha, RKNicodème, E Discovery of epigenetic regulator I-BET762: lead optimization to afford a clinical candidate inhibitor of the BET bromodomains. J Med Chem56:7501-15 (2013) 
 
Bromodomain-containing protein 3
Name:Bromodomain-containing protein 3
Type:Protein
Mol. Mass.:79571.81
Organism:Homo sapiens (Human)
Description:Q15059
Residue:726
BDBM50441168
NameBDBM50441168
Synonyms:CHEMBL2430873
TypeSmall organic molecule
Emp. Form.C20H19N5O2
Mol. Mass.361.3972
SMILESCCOC(=O)N[C@@H]1N=C(c2ccccc2)c2ccccc2-n2c(C)nnc12