Reaction Details
TargetBromodomain-containing protein 3
LigandBDBM50441171
Substrate/Competitorn/a
Meas. Tech.ChEMBL_985089 (CHEMBL2433594)
IC50 1000±n/a nM
Citation Mirguet, OGosmini, RToum, JClément, CABarnathan, MBrusq, JMMordaunt, JEGrimes, RMCrowe, MPineau, OAjakane, MDaugan, AJeffrey, PCutler, LHaynes, ACSmithers, NNChung, CWBamborough, PUings, IJLewis, AWitherington, JParr, NPrinjha, RKNicodème, E Discovery of epigenetic regulator I-BET762: lead optimization to afford a clinical candidate inhibitor of the BET bromodomains. J Med Chem56:7501-15 (2013) 
 
Bromodomain-containing protein 3
Name:Bromodomain-containing protein 3
Type:Protein
Mol. Mass.:79571.81
Organism:Homo sapiens (Human)
Description:Q15059
Residue:726
BDBM50441171
NameBDBM50441171
Synonyms:CHEMBL2430869
TypeSmall organic molecule
Emp. Form.C25H20FN5O2
Mol. Mass.441.457
SMILESCc1nnc2C(NC(=O)OCc3ccc(F)cc3)N=C(c3ccccc3)c3ccccc3-n12