Reaction Details
TargetBromodomain-containing protein 2
LigandBDBM50441176
Substrate/Competitorn/a
Meas. Tech.ChEMBL_985088 (CHEMBL2433593)
IC50 794±n/a nM
Citation Mirguet, OGosmini, RToum, JClément, CABarnathan, MBrusq, JMMordaunt, JEGrimes, RMCrowe, MPineau, OAjakane, MDaugan, AJeffrey, PCutler, LHaynes, ACSmithers, NNChung, CWBamborough, PUings, IJLewis, AWitherington, JParr, NPrinjha, RKNicodème, E Discovery of epigenetic regulator I-BET762: lead optimization to afford a clinical candidate inhibitor of the BET bromodomains. J Med Chem56:7501-15 (2013) 
 
Bromodomain-containing protein 2
Name:Bromodomain-containing protein 2
Type:Protein
Mol. Mass.:88085.95
Organism:Homo sapiens (Human)
Description:P25440
Residue:801
BDBM50441176
NameBDBM50441176
Synonyms:CHEMBL2430892
TypeSmall organic molecule
Emp. Form.C26H23N5O3
Mol. Mass.453.4925
SMILESCOc1ccc-2c(c1)C(=NC(NC(=O)OCc1ccccc1)c1nnc(C)n-21)c1ccccc1