Reaction Details
TargetGlutamate carboxypeptidase 2
LigandBDBM17659
Substrate/Competitorn/a
Meas. Tech.ChEMBL_984057 (CHEMBL2434267)
Ki 31±n/a nM
Citation Harada, NKimura, HOno, MSaji, H Preparation of asymmetric urea derivatives that target prostate-specific membrane antigen for SPECT imaging. J Med Chem56:7890-901 (2013) 
 
Glutamate carboxypeptidase 2
Name:Glutamate carboxypeptidase 2
Type:PROTEIN
Mol. Mass.:84333.66
Organism:Homo sapiens (Human)
Description:ChEMBL_1497035
Residue:750
BDBM17659
NameBDBM17659
Synonyms:(R,S)-2-phosphonomethylpentanedioic acid 2-PMPA US10894807, ID P009 | pentanedioic acid analogue, (RS)-1
TypeSmall organic molecule
Emp. Form.C6H11O7P
Mol. Mass.226.1211
SMILESOC(=O)CCC(CP(O)(O)=O)C(O)=O