Reaction Details
TargetPoly [ADP-ribose] polymerase 1
LigandBDBM50310190
Substrate/Competitorn/a
Meas. Tech.ChEMBL_984398 (CHEMBL2433122)
IC50 7100±n/a nM
Citation Narwal, MKoivunen, JHaikarainen, TObaji, ELegala, OEVenkannagari, HJoensuu, PPihlajaniemi, TLehtiö, L Discovery of tankyrase inhibiting flavones with increased potency and isoenzyme selectivity. J Med Chem56:7880-9 (2013) 
 
Poly [ADP-ribose] polymerase 1
Name:Poly [ADP-ribose] polymerase 1
Type:n/a
Mol. Mass.:113114.22
Organism:Homo sapiens (Human)
Description:P09874
Residue:1014
BDBM50310190
NameBDBM50310190
Synonyms:2-p-Tolyl-chromen-4-one CHEMBL16861
TypeSmall organic molecule
Emp. Form.C16H12O2
Mol. Mass.236.2653
SMILESCc1ccc(cc1)-c1cc(=O)c2ccccc2o1