Reaction Details
TargetNeuronal acetylcholine receptor subunit alpha-4/beta-2
LigandBDBM50441362
Substrate/Competitorn/a
Meas. Tech.ChEMBL_986916 (CHEMBL2438882)
Ki 1100±n/a nM
Citation Kombo, DCGrinevich, VPHauser, TASidach, SBencherif, M QM-polarized ligand docking accurately predicts the trend in binding affinity of a series of arylmethylene quinuclidine-like derivatives at thea4ß2 anda3ß4 nicotinic acetylcholine receptors (nAChRs). Bioorg Med Chem Lett23:4842-7 (2013) 
 
Neuronal acetylcholine receptor subunit alpha-4/beta-2
Name:Neuronal acetylcholine receptor subunit alpha-4/beta-2
Type:Protein
Mol. Mass.:n/a
Description:n/a
Components:This complex has 2 components.
Component 1
Name:Neuronal acetylcholine receptor subunit alpha-4
Synonyms:ACHA4_HUMAN CHRNA4 protein Neuronal acetylcholine receptor protein alpha-4 subunit Nicotinic acetylcholine receptor alpha4/beta2/alpha5
Type:n/a
Mol. Mass.:69963.49
Organism:Homo sapiens (Human)
Description:NACHRA4
Residue:627
Component 2
Name:Neuronal acetylcholine receptor subunit beta-2
Synonyms:ACHB2_HUMAN Neuronal acetylcholine receptor protein beta-2 subunit | Nicotinic acetylcholine receptor alpha3/beta2/alpha5
Type:Protein
Mol. Mass.:57020.50
Organism:Homo sapiens (Human)
Description:P17787
Residue:502
BDBM50441362
NameBDBM50441362
Synonyms:CHEMBL2435282
TypeSmall organic molecule
Emp. Form.C15H16N2
Mol. Mass.224.3009
SMILESN#C\C(=C1/CN2CCC1CC2)c1ccccc1