Reaction Details
TargetBifunctional epoxide hydrolase 2
LigandBDBM50441476
Substrate/Competitorn/a
Meas. Tech.ChEMBL_988349 (CHEMBL2437612)
IC50 0.200000±n/a nM
Citation Kato, YFuchi, NSaburi, HNishimura, YWatanabe, AYagi, MNakadera, YHigashi, EYamada, MAoki, T Discovery of 2,8-diazaspiro[4.5]decane-based trisubstituted urea derivatives as highly potent soluble epoxide hydrolase inhibitors and orally active drug candidates for treating hypertension. Bioorg Med Chem Lett23:5975-9 (2013) 
 
Bifunctional epoxide hydrolase 2
Name:Bifunctional epoxide hydrolase 2
Type:Enzyme
Mol. Mass.:62613.07
Organism:Homo sapiens (Human)
Description:P34913
Residue:555
BDBM50441476
NameBDBM50441476
Synonyms:CHEMBL2436575
TypeSmall organic molecule
Emp. Form.C26H25F3N4O3
Mol. Mass.498.4969
SMILESFC(F)(F)Oc1ccc(NC(=O)N2CCC3(C2)CCN(CC3)C(=O)c2cccc3ncccc23)cc1