Reaction Details
TargetBifunctional epoxide hydrolase 2
LigandBDBM50441483
Substrate/Competitorn/a
Meas. Tech.ChEMBL_988349 (CHEMBL2437612)
IC50 0.300000±n/a nM
Citation Kato, YFuchi, NSaburi, HNishimura, YWatanabe, AYagi, MNakadera, YHigashi, EYamada, MAoki, T Discovery of 2,8-diazaspiro[4.5]decane-based trisubstituted urea derivatives as highly potent soluble epoxide hydrolase inhibitors and orally active drug candidates for treating hypertension. Bioorg Med Chem Lett23:5975-9 (2013) 
 
Bifunctional epoxide hydrolase 2
Name:Bifunctional epoxide hydrolase 2
Type:Enzyme
Mol. Mass.:62613.07
Organism:Homo sapiens (Human)
Description:P34913
Residue:555
BDBM50441483
NameBDBM50441483
Synonyms:CHEMBL2436591
TypeSmall organic molecule
Emp. Form.C22H30F3N3O3
Mol. Mass.441.4871
SMILESCCC(CC)C(=O)N1CCC2(CCN(C2)C(=O)Nc2ccc(OC(F)(F)F)cc2)CC1