Reaction Details
TargetPhosphodiesterase
LigandBDBM50441528
Substrate/Competitorn/a
Meas. Tech.ChEMBL_988574 (CHEMBL2438433)
IC50 278±n/a nM
Citation Woodring, JLBland, NDOchiana, SOCampbell, RKPollastri, MP Synthesis and assessment of catechol diether compounds as inhibitors of trypanosomal phosphodiesterase B1 (TbrPDEB1). Bioorg Med Chem Lett23:5971-4 (2013) 
 
Phosphodiesterase
Name:Phosphodiesterase
Type:Protein
Mol. Mass.:103683.20
Organism:Trypanosoma brucei
Description:n/a
Residue:930
BDBM50441528
NameBDBM50441528
Synonyms:CHEMBL2436772
TypeSmall organic molecule
Emp. Form.C25H34N2O2
Mol. Mass.394.5497
SMILESCOc1ccc(cc1OC1CCCC1)C1=NN(C[C@H]2CC=CC[C@@H]12)C1CCCC1