Reaction Details
TargetEgl nine homolog 1
LigandBDBM50193145
Substrate/Competitorn/a
Meas. Tech.ChEMBL_988611 (CHEMBL2438562)
IC50 3900±n/a nM
Citation Hong, YRKim, HTLee, SCRo, SCho, JMKim, ISJung, YH [(4-Hydroxyl-benzo[4,5]thieno[3,2-c]pyridine-3-carbonyl)-amino]-acetic acid derivatives; HIF prolyl 4-hydroxylase inhibitors as oral erythropoietin secretagogues. Bioorg Med Chem Lett23:5953-7 (2013) 
 
Egl nine homolog 1
Name:Egl nine homolog 1
Type:Protein
Mol. Mass.:46035.59
Organism:Homo sapiens (Human)
Description:Q9GZT9
Residue:426
BDBM50193145
NameBDBM50193145
Synonyms:2-(1-chloro-4-hydroxyisoquinoline-3-carboxamido)acetic acid Isoquinoline 3 | N-[(1-CHLORO-4-HYDROXYISOQUINOLIN-3-YL)CARBONYL]GLYCINE
TypeSmall organic molecule
Emp. Form.C12H9ClN2O4
Mol. Mass.280.664
SMILESOC(=O)CNC(=O)c1nc(Cl)c2ccccc2c1O