Reaction Details
TargetTyrosine-protein kinase JAK2
LigandBDBM50441544
Substrate/Competitorn/a
Meas. Tech.ChEMBL_988624 (CHEMBL2438691)
Ki 1.8±n/a nM
Citation Labadie, SBarrett, KBlair, WSChang, CDeshmukh, GEigenbrot, CGibbons, PJohnson, AKenny, JRKohli, PBLiimatta, MLupardus, PJShia, SSteffek, MUbhayakar, Svan Abbema, AZak, M Design and evaluation of novel 8-oxo-pyridopyrimidine Jak1/2 inhibitors. Bioorg Med Chem Lett23:5923-30 (2013) 
 
Tyrosine-protein kinase JAK2
Name:Tyrosine-protein kinase JAK2
Type:Protein
Mol. Mass.:130684.68
Organism:Homo sapiens (Human)
Description:O60674
Residue:1132
BDBM50441544
NameBDBM50441544
Synonyms:CHEMBL2436939
TypeSmall organic molecule
Emp. Form.C14H16N6O
Mol. Mass.284.3164
SMILESCNc1nc(N[C@@H]2CCC[C@@H]2C#N)c2cc[nH]c(=O)c2n1