Reaction Details
TargetProtein delta homolog 1
LigandBDBM50441567
Substrate/Competitorn/a
Meas. Tech.ChEMBL_988919 (CHEMBL2439773)
IC50 150±n/a nM
Citation Goodfellow, VSLoweth, CJRavula, SBWiemann, TNguyen, TXu, YTodd, DESheppard, DPollack, SPolesskaya, OMarker, DFDewhurst, SGelbard, HA Discovery, synthesis, and characterization of an orally bioavailable, brain penetrant inhibitor of mixed lineage kinase 3. J Med Chem56:8032-48 (2013) 
 
Protein delta homolog 1
Name:Protein delta homolog 1
Type:PROTEIN
Mol. Mass.:41294.81
Organism:Homo sapiens (Human)
Description:ChEMBL_1444684
Residue:383
BDBM50441567
NameBDBM50441567
Synonyms:CHEMBL2436978 | US10485800, Example 181
TypeSmall organic molecule
Emp. Form.C27H27N5
Mol. Mass.421.5368
SMILESCN1CCN(Cc2ccc(cc2)-c2cnc3[nH]cc(-c4ccc5[nH]ccc5c4)c3c2)CC1