Reaction Details
TargetCytochrome P450 2D6
LigandBDBM50441568
Substrate/Competitorn/a
Meas. Tech.ChEMBL_988940 (CHEMBL2439900)
IC50 13200±n/a nM
Citation Goodfellow, VSLoweth, CJRavula, SBWiemann, TNguyen, TXu, YTodd, DESheppard, DPollack, SPolesskaya, OMarker, DFDewhurst, SGelbard, HA Discovery, synthesis, and characterization of an orally bioavailable, brain penetrant inhibitor of mixed lineage kinase 3. J Med Chem56:8032-48 (2013) 
 
Cytochrome P450 2D6
Name:Cytochrome P450 2D6
Type:Protein
Mol. Mass.:55774.82
Organism:Homo sapiens (Human)
Description:P10635
Residue:497
BDBM50441568
NameBDBM50441568
Synonyms:CHEMBL2436983 US9814704, Example 9
TypeSmall organic molecule
Emp. Form.C19H14N6
Mol. Mass.326.3547
SMILESNc1ncc(cn1)-c1cnc2[nH]cc(-c3ccc4[nH]ccc4c3)c2c1