Reaction Details
TargetMitogen-activated protein kinase kinase kinase 11
LigandBDBM50441566
Substrate/Competitorn/a
Meas. Tech.ChEMBL_986643 (CHEMBL2437703)
IC50 21±n/a nM
Citation Goodfellow, VSLoweth, CJRavula, SBWiemann, TNguyen, TXu, YTodd, DESheppard, DPollack, SPolesskaya, OMarker, DFDewhurst, SGelbard, HA Discovery, synthesis, and characterization of an orally bioavailable, brain penetrant inhibitor of mixed lineage kinase 3. J Med Chem56:8032-48 (2013) 
 
Mitogen-activated protein kinase kinase kinase 11
Name:Mitogen-activated protein kinase kinase kinase 11
Type:PROTEIN
Mol. Mass.:92696.93
Organism:Homo sapiens (Human)
Description:ChEMBL_1460565
Residue:847
BDBM50441566
NameBDBM50441566
Synonyms:CHEMBL2436977 | US10485800, Example 179
TypeSmall organic molecule
Emp. Form.C26H26N6
Mol. Mass.422.5248
SMILESCN1CCN(Cc2ccc(cc2)-c2cnc3[nH]cc(-c4cnc5[nH]ccc5c4)c3c2)CC1