Reaction Details
TargetRho-associated protein kinase 1
LigandBDBM50441567
Substrate/Competitorn/a
Meas. Tech.ChEMBL_988903 (CHEMBL2439757)
IC50 1030±n/a nM
Citation Goodfellow, VSLoweth, CJRavula, SBWiemann, TNguyen, TXu, YTodd, DESheppard, DPollack, SPolesskaya, OMarker, DFDewhurst, SGelbard, HA Discovery, synthesis, and characterization of an orally bioavailable, brain penetrant inhibitor of mixed lineage kinase 3. J Med Chem56:8032-48 (2013) 
 
Rho-associated protein kinase 1
Name:Rho-associated protein kinase 1
Type:Serine/threonine-protein kinase
Mol. Mass.:158156.77
Organism:Homo sapiens (Human)
Description:Q13464
Residue:1354
BDBM50441567
NameBDBM50441567
Synonyms:CHEMBL2436978 | US10485800, Example 181
TypeSmall organic molecule
Emp. Form.C27H27N5
Mol. Mass.421.5368
SMILESCN1CCN(Cc2ccc(cc2)-c2cnc3[nH]cc(-c4ccc5[nH]ccc5c4)c3c2)CC1