Reaction Details
TargetCytochrome P450 2C9
LigandBDBM356235
Substrate/Competitorn/a
Meas. Tech.ChEMBL_988939 (CHEMBL2439899)
IC50>30000±n/a nM
Citation Goodfellow, VSLoweth, CJRavula, SBWiemann, TNguyen, TXu, YTodd, DESheppard, DPollack, SPolesskaya, OMarker, DFDewhurst, SGelbard, HA Discovery, synthesis, and characterization of an orally bioavailable, brain penetrant inhibitor of mixed lineage kinase 3. J Med Chem56:8032-48 (2013) 
 
Cytochrome P450 2C9
Name:Cytochrome P450 2C9
Type:Enzyme
Mol. Mass.:55636.33
Organism:Homo sapiens (Human)
Description:P11712
Residue:490
BDBM356235
NameBDBM356235
Synonyms:BDBM50441572 US9814704, Example 36
Typen/a
Emp. Form.C24H21N3O3
Mol. Mass.399.4418
SMILESCOc1cc(cc(OC)c1OC)-c1cnc2[nH]cc(-c3ccc4[nH]ccc4c3)c2c1