Reaction Details
TargetCytochrome P450 2D6
LigandBDBM50441570
Substrate/Competitorn/a
Meas. Tech.ChEMBL_988940 (CHEMBL2439900)
IC50>30000±n/a nM
Citation Goodfellow, VSLoweth, CJRavula, SBWiemann, TNguyen, TXu, YTodd, DESheppard, DPollack, SPolesskaya, OMarker, DFDewhurst, SGelbard, HA Discovery, synthesis, and characterization of an orally bioavailable, brain penetrant inhibitor of mixed lineage kinase 3. J Med Chem56:8032-48 (2013) 
 
Cytochrome P450 2D6
Name:Cytochrome P450 2D6
Type:Protein
Mol. Mass.:55774.82
Organism:Homo sapiens (Human)
Description:P10635
Residue:497
BDBM50441570
NameBDBM50441570
Synonyms:CHEMBL2436976 US9814704, Example 17
TypeSmall organic molecule
Emp. Form.C20H19N5O3
Mol. Mass.377.3966
SMILESCOc1cc(cc(OC)c1OC)-c1cnc2[nH]cc(-c3cnc(N)nc3)c2c1