Reaction Details
TargetHistamine H3 receptor
LigandBDBM50441641
Substrate/Competitorn/a
Meas. Tech.ChEMBL_986996 (CHEMBL2439316)
Ki 2.2±n/a nM
Citation Zeng, QRosenblum, SBYang, ZJiang, YMcCormick, KDAslanian, RGDuguma, LKozlowski, JAShih, NYHey, JAWest, REKorfmacher, WABerlin, MBoyce, CW Synthesis and SAR studies of benzimidazolone derivatives as histamine H3-receptor antagonists. Bioorg Med Chem Lett23:6001-3 (2013) 
 
Histamine H3 receptor
Name:Histamine H3 receptor
Type:Enzyme Catalytic Domain
Mol. Mass.:48753.61
Organism:GUINEA PIG
Description:HISTAMINE H3 HRH3 GUINEA PIG::Q9JI35
Residue:445
BDBM50441641
NameBDBM50441641
Synonyms:CHEMBL2437426
TypeSmall organic molecule
Emp. Form.C28H35FN6O2
Mol. Mass.506.6149
SMILESNc1cc(CN2CCC(CC2)C(=O)N2CCC(CC2)n2c3ccc(F)cc3n(CC3CC3)c2=O)ccn1