Reaction Details
TargetTGF-beta receptor type-1
LigandBDBM50110208
Substrate/Competitorn/a
Meas. Tech.ChEMBL_987174 (CHEMBL2437531)
IC50 350±n/a nM
Citation Guo, CZhang, CLi, XLi, WXu, ZBao, LDing, YWang, LLi, S Synthesis and biological evaluation of 1,2,4-trisubstituted imidazoles as inhibitors of transforming growth factor-ß type I receptor (ALK5). Bioorg Med Chem Lett23:5850-4 (2013) 
 
TGF-beta receptor type-1
Name:TGF-beta receptor type-1
Type:enzyme
Mol. Mass.:55968.24
Organism:Homo sapiens (Human)
Description:P36897
Residue:503
BDBM50110208
NameBDBM50110208
Synonyms:4-(4-(benzo[d][1,3]dioxol-5-yl)-5-(pyridin-2-yl)-1H-imidazol-2-yl)benzamide 4-(5-(benzo[d][1,3]dioxol-5-yl)-4-(pyridin-2-yl)-1H-imidazol-2-yl)benzamide CHEMBL440084 cid_4521392
TypeSmall organic molecule
Emp. Form.C22H16N4O3
Mol. Mass.384.3874
SMILESNC(=O)c1ccc(cc1)-c1nc(c([nH]1)-c1ccc2OCOc2c1)-c1ccccn1