Reaction Details
TargetPapain
LigandBDBM50441677
Substrate/Competitorn/a
Meas. Tech.ChEMBL_988143 (CHEMBL2439234)
IC50>10000±n/a nM
Citation Ribeiro, CJKumar, SPGut, JGonçalves, LMRosenthal, PJMoreira, RSantos, MM Squaric acid/4-aminoquinoline conjugates: novel potent antiplasmodial agents. Eur J Med Chem69:365-72 (2013) 
 
Papain
Name:Papain
Type:Enzyme
Mol. Mass.:38923.01
Organism:Carica papaya
Description:Papain was purchased from Sigma, Germany.
Residue:345
BDBM50441677
NameBDBM50441677
Synonyms:CHEMBL2435702
TypeSmall organic molecule
Emp. Form.C30H30Cl2N6O2
Mol. Mass.577.504
SMILESClc1ccc2c(NCCCCNc3c(NCCCCNc4ccnc5cc(Cl)ccc45)c(=O)c3=O)ccnc2c1