Reaction Details
TargetPapain
LigandBDBM50441684
Substrate/Competitorn/a
Meas. Tech.ChEMBL_988143 (CHEMBL2439234)
IC50>10000±n/a nM
Citation Ribeiro, CJKumar, SPGut, JGonçalves, LMRosenthal, PJMoreira, RSantos, MM Squaric acid/4-aminoquinoline conjugates: novel potent antiplasmodial agents. Eur J Med Chem69:365-72 (2013) 
 
Papain
Name:Papain
Type:Enzyme
Mol. Mass.:38923.01
Organism:Carica papaya
Description:Papain was purchased from Sigma, Germany.
Residue:345
BDBM50441684
NameBDBM50441684
Synonyms:CHEMBL2435694
TypeSmall organic molecule
Emp. Form.C16H14ClN3O3
Mol. Mass.331.754
SMILESCOc1c(NCCNc2ccnc3cc(Cl)ccc23)c(=O)c1=O