Reaction Details
TargetBeta-adrenergic receptor kinase 1
LigandBDBM50441685
Substrate/Competitorn/a
Meas. Tech.ChEMBL_988156 (CHEMBL2439247)
IC50 340±n/a nM
Citation Carotenuto, ACipolletta, EGomez-Monterrey, ISala, MVernieri, ELimatola, ABertamino, AMusella, SSorriento, DGrieco, PTrimarco, BNovellino, EIaccarino, GCampiglia, P Design, synthesis and efficacy of novel G protein-coupled receptor kinase 2 inhibitors. Eur J Med Chem69:384-92 (2013) 
 
Beta-adrenergic receptor kinase 1
Name:Beta-adrenergic receptor kinase 1
Type:Enzyme
Mol. Mass.:79581.30
Organism:Homo sapiens (Human)
Description:P25098
Residue:689
BDBM50441685
NameBDBM50441685
Synonyms:CHEMBL2435840
TypeSmall organic molecule
Emp. Form.C41H74N16O10
Mol. Mass.951.1275
SMILESCC[C@H](C)[C@H](NC(=O)[C@H](CO)NC(=O)[C@H](Cc1cnc[nH]1)NC(=O)[C@@H](CCCN=C(N)N)NC(=O)[C@H](CCCN=C(N)N)NC(=O)[C@H](CC(C)C)NC(=O)[C@H](CC(C)C)NC(=O)CN)C(O)=O