Reaction Details
TargetC-C chemokine receptor type 5
LigandBDBM50441722
Substrate/Competitorn/a
Meas. Tech.ChEMBL_988290 (CHEMBL2439744)
IC50 1.3±n/a nM
Citation Skerlj, RBridger, GZhou, YBourque, EMcEachern, EMetz, MHarwig, CLi, TSYang, WBogucki, DZhu, YLangille, JVeale, DBa, TBey, MBaird, IKaller, AKrumpak, MLeitch, DSatori, MVocadlo, KGuay, DNan, SYee, HCrawford, JChen, GWilson, TCarpenter, BGauthier, DMacfarland, RMosi, RBodart, VWong, RFricker, SSchols, D Design of substituted imidazolidinylpiperidinylbenzoic acids as chemokine receptor 5 antagonists: potent inhibitors of R5 HIV-1 replication. J Med Chem56:8049-65 (2013) 
 
C-C chemokine receptor type 5
Name:C-C chemokine receptor type 5
Type:Enzyme
Mol. Mass.:40540.21
Organism:Homo sapiens (Human)
Description:P51681
Residue:352
BDBM50441722
NameBDBM50441722
Synonyms:CHEMBL2435843
TypeSmall organic molecule
Emp. Form.C34H41N5O4
Mol. Mass.583.7204
SMILESCNC(=O)c1ccc(Oc2ccc(CN3CCC(CC3)N3[C@@H](CN(C4CCOCC4)C3=O)c3ccccc3)c(C)n2)cc1