Reaction Details
TargetTyrosine-protein phosphatase non-receptor type 1
LigandBDBM50441783
Substrate/Competitorn/a
Meas. Tech.ChEMBL_988373 (CHEMBL2437800)
IC50 1180±n/a nM
Citation Chen, YTTang, CLMa, WPGao, LXWei, YZhang, WLi, JYLi, JNan, FJ Design, synthesis, and biological evaluation of novel 2-ethyl-5-phenylthiazole-4-carboxamide derivatives as protein tyrosine phosphatase 1B inhibitors with improved cellular efficacy. Eur J Med Chem69:399-412 (2013) 
 
Tyrosine-protein phosphatase non-receptor type 1
Name:Tyrosine-protein phosphatase non-receptor type 1
Type:Protein phosphatase
Mol. Mass.:49963.76
Organism:Homo sapiens (Human)
Description:Human recombinant GST-fusion PTP1B (1-435).
Residue:435
BDBM50441783
NameBDBM50441783
Synonyms:CHEMBL2436039
TypeSmall organic molecule
Emp. Form.C43H35BrN4O5S
Mol. Mass.799.731
SMILESOC(=O)c1ccc(Br)cc1NC(=O)c1nc(sc1-c1ccccc1)[C@H](Cc1ccc(OCc2ccccc2)cc1)NC(=O)CCc1c[nH]c2ccccc12