Reaction Details
TargetTyrosine-protein phosphatase non-receptor type 1
LigandBDBM50441779
Substrate/Competitorn/a
Meas. Tech.ChEMBL_988373 (CHEMBL2437800)
IC50 1170±n/a nM
Citation Chen, YTTang, CLMa, WPGao, LXWei, YZhang, WLi, JYLi, JNan, FJ Design, synthesis, and biological evaluation of novel 2-ethyl-5-phenylthiazole-4-carboxamide derivatives as protein tyrosine phosphatase 1B inhibitors with improved cellular efficacy. Eur J Med Chem69:399-412 (2013) 
 
Tyrosine-protein phosphatase non-receptor type 1
Name:Tyrosine-protein phosphatase non-receptor type 1
Type:Protein phosphatase
Mol. Mass.:49963.76
Organism:Homo sapiens (Human)
Description:Human recombinant GST-fusion PTP1B (1-435).
Residue:435
BDBM50441779
NameBDBM50441779
Synonyms:CHEMBL2436030
TypeSmall organic molecule
Emp. Form.C39H37N3O5S
Mol. Mass.659.793
SMILESOC(=O)c1cccc(NC(=O)c2nc(sc2-c2ccccc2)[C@H](Cc2ccc(OCc3ccccc3)cc2)NC(=O)C2CCCCC2)c1