Reaction Details
TargetE3 ubiquitin-protein ligase XIAP
LigandBDBM50441334
Substrate/Competitorn/a
Meas. Tech.ChEMBL_988991 (CHEMBL2437637)
IC50 32±n/a nM
Citation Kester, RFDonnell, AFLou, YRemiszewski, SWLombardo, LJChen, SLe, NTLo, JMoliterni, JAHan, XHogg, JHLiang, WMichoud, CRupert, KCMischke, SLe, KWeisel, MJanson, CALukacs, CMFretland, AJHong, KPolonskaia, AGao, LLi, SSolis, DSAguilar, DTardell, CDvorozniak, MTannu, SLee, ECSchutt, ADGoggin, B Optimization of benzodiazepinones as selective inhibitors of the X-linked inhibitor of apoptosis protein (XIAP) second baculovirus IAP repeat (BIR2) domain. J Med Chem56:7788-803 (2013) 
 
E3 ubiquitin-protein ligase XIAP
Name:E3 ubiquitin-protein ligase XIAP
Type:Protein
Mol. Mass.:56685.27
Organism:Homo sapiens (Human)
Description:P98170
Residue:497
BDBM50441334
NameBDBM50441334
Synonyms:CHEMBL2431755 | CHEMBL2436227
TypeSmall organic molecule
Emp. Form.C34H32N6O4
Mol. Mass.588.6557
SMILESCN[C@@H](C)C(=O)N[C@@H]1C(=O)N(Cc2c(C#N)n(-c3ccccc3C#N)c3ccccc23)c2ccccc2OC11CCOCC1