Reaction Details
TargetE3 ubiquitin-protein ligase XIAP
LigandBDBM50441356
Substrate/Competitorn/a
Meas. Tech.ChEMBL_988995 (CHEMBL2437641)
IC50 30±n/a nM
Citation Kester, RFDonnell, AFLou, YRemiszewski, SWLombardo, LJChen, SLe, NTLo, JMoliterni, JAHan, XHogg, JHLiang, WMichoud, CRupert, KCMischke, SLe, KWeisel, MJanson, CALukacs, CMFretland, AJHong, KPolonskaia, AGao, LLi, SSolis, DSAguilar, DTardell, CDvorozniak, MTannu, SLee, ECSchutt, ADGoggin, B Optimization of benzodiazepinones as selective inhibitors of the X-linked inhibitor of apoptosis protein (XIAP) second baculovirus IAP repeat (BIR2) domain. J Med Chem56:7788-803 (2013) 
 
E3 ubiquitin-protein ligase XIAP
Name:E3 ubiquitin-protein ligase XIAP
Type:Protein
Mol. Mass.:56685.27
Organism:Homo sapiens (Human)
Description:P98170
Residue:497
BDBM50441356
NameBDBM50441356
Synonyms:CHEMBL2431768
TypeSmall organic molecule
Emp. Form.C26H33FN4O3S
Mol. Mass.500.629
SMILESCN[C@@H](C)C(=O)N[C@@H](C1CCCCC1)C(=O)N1CCC[C@H]1c1nc(cs1)C(=O)c1ccc(F)cc1