Reaction Details
TargetE3 ubiquitin-protein ligase XIAP
LigandBDBM50441827
Substrate/Competitorn/a
Meas. Tech.ChEMBL_988991 (CHEMBL2437637)
IC50 9.0±n/a nM
Citation Kester, RFDonnell, AFLou, YRemiszewski, SWLombardo, LJChen, SLe, NTLo, JMoliterni, JAHan, XHogg, JHLiang, WMichoud, CRupert, KCMischke, SLe, KWeisel, MJanson, CALukacs, CMFretland, AJHong, KPolonskaia, AGao, LLi, SSolis, DSAguilar, DTardell, CDvorozniak, MTannu, SLee, ECSchutt, ADGoggin, B Optimization of benzodiazepinones as selective inhibitors of the X-linked inhibitor of apoptosis protein (XIAP) second baculovirus IAP repeat (BIR2) domain. J Med Chem56:7788-803 (2013) 
 
E3 ubiquitin-protein ligase XIAP
Name:E3 ubiquitin-protein ligase XIAP
Type:Protein
Mol. Mass.:56685.27
Organism:Homo sapiens (Human)
Description:P98170
Residue:497
BDBM50441827
NameBDBM50441827
Synonyms:CHEMBL2436217 | US9422331, 11
TypeSmall organic molecule
Emp. Form.C29H33BrN4O6S
Mol. Mass.645.565
SMILESCN[C@@H](C)C(=O)N[C@H]1[C@H](C)N(C(=O)CS(C)(=O)=O)c2ccccc2N(Cc2c(OC)ccc3c(Br)cccc23)C1=O