Reaction Details
TargetE3 ubiquitin-protein ligase XIAP
LigandBDBM50441832
Substrate/Competitorn/a
Meas. Tech.ChEMBL_988991 (CHEMBL2437637)
IC50 6.0±n/a nM
Citation Kester, RFDonnell, AFLou, YRemiszewski, SWLombardo, LJChen, SLe, NTLo, JMoliterni, JAHan, XHogg, JHLiang, WMichoud, CRupert, KCMischke, SLe, KWeisel, MJanson, CALukacs, CMFretland, AJHong, KPolonskaia, AGao, LLi, SSolis, DSAguilar, DTardell, CDvorozniak, MTannu, SLee, ECSchutt, ADGoggin, B Optimization of benzodiazepinones as selective inhibitors of the X-linked inhibitor of apoptosis protein (XIAP) second baculovirus IAP repeat (BIR2) domain. J Med Chem56:7788-803 (2013) 
 
E3 ubiquitin-protein ligase XIAP
Name:E3 ubiquitin-protein ligase XIAP
Type:Protein
Mol. Mass.:56685.27
Organism:Homo sapiens (Human)
Description:P98170
Residue:497
BDBM50441832
NameBDBM50441832
Synonyms:CHEMBL2436205 | US10053431, 90d
TypeSmall organic molecule
Emp. Form.C33H33BrN4O6S
Mol. Mass.693.607
SMILESCN[C@@H](C)C(=O)N[C@H]1CN(C(=O)c2ccc(cc2)S(C)(=O)=O)c2ccccc2N(Cc2c(OC)ccc3cc(Br)ccc23)C1=O