Reaction Details
TargetSigma non-opioid intracellular receptor 1
LigandBDBM81982
Substrate/Competitorn/a
Meas. Tech.ChEMBL_988998 (CHEMBL2437644)
Ki 89±n/a nM
Citation Harel, DSchepmann, DWünsch, B New combination of pharmacophoric elements of potents1 ligands: design, synthesis ands receptor affinity of aminoethyl substituted tetrahydrobenzothiophenes. Eur J Med Chem69:490-7 (2013) 
 
Sigma non-opioid intracellular receptor 1
Name:Sigma non-opioid intracellular receptor 1
Type:Protein
Mol. Mass.:25307.17
Organism:Cavia porcellus (Guinea pig)
Description:Q60492
Residue:223
BDBM81982
NameBDBM81982
Synonyms:CAS_97-39-2 DTG Tol2Gdn | cid_7333
TypeSmall organic molecule
Emp. Form.C15H17N3
Mol. Mass.239.3156
SMILESCc1ccccc1NC(N)=Nc1ccccc1C